{"text_format":"1","workbook":"xlsx","n_sheets":6,"sheets":["查询","新旧计划","专业","计划","课程代码","强实践"],"not_rendered":{"charts":0,"images":2,"macros":1,"external_links":0,"defined_names":8,"comments":0,"pivot_tables":0},"unopened":[],"bounds":{"document_bytes":16777216,"sheet_cells":100000,"rows_first":2000,"rows_last":500,"rows_between":2000,"halvings":0,"cell_chars":16384,"cell_head_chars":4096},"cells_cut":0,"cells_raw":0,"read":"whole","date_system":"1900"}

{"sheet":"查询","index":0,"n_rows":43,"n_cols":14,"rows_kept":43,"cut":false,"hidden":false,"merged":[[42,5,42,7],[2,13,3,13],[7,13,40,13],[0,14,2,14],[0,0,0,9],[3,6,3,7],[40,0,40,4],[41,0,41,9]]}
["湖 南 省 自 学 考 试 专 业 计 划 成 绩 查 询 单"]
[]
[null,null,null,null,null,null,null,null,null,null,null,null,null,"↓ 请选择专业 ↓"]
["序号","课程代码","课程名称","国省","学分","通过时间","成绩已得学分",null,"替代","备注"]
["01",{"$f":"IFERROR(VLOOKUP(N$5&A5,计划!B:E,4,0),\"\")","v":""},{"$f":"IFERROR(VLOOKUP(N$5&A5,计划!B:F,5,0),\"\")","v":""},{"$f":"IFERROR(VLOOKUP(B5,课程代码!B:E,4,0),\"\")","v":""},{"$f":"IFERROR(VLOOKUP(N$5&A5,计划!B:G,6,0),\"\")","v":""},{"$f":"IFERROR(VLOOKUP(B5,IF({1,0},R:R,Q:Q),2,0),\"\")","v":""},{"$f":"IFERROR(VLOOKUP(B5,R:X,4,0),\"\")","v":""},{"$f":"IFERROR(IF(G5<>\"\",VLOOKUP(N$5&A5,计划!B:G,6,0),\"\"),\"\")&IFERROR(IF(I5<>\"\",VLOOKUP(N$5&A5,计划!B:G,6,0),\"\"),\"\")","v":""},{"$f":"IFERROR(VLOOKUP(K5,R:X,4,0),\"\")&IFERROR(VLOOKUP(L5,R:X,4,0),\"\")&IFERROR(VLOOKUP(M5,R:X,4,0),\"\")","v":""},{"$f":"IF(IFERROR(VLOOKUP(N$5&A5,计划!B:H,7,0),\"\")=0,\"\",IFERROR(VLOOKUP(N$5&A5,计划!B:H,7,0),\"\"))","v":""},{"$f":"IF(IFERROR(VLOOKUP(N$5&A5,计划!B:I,8,0),\"\")=0,\"\",IFERROR(VLOOKUP(N$5&A5,计划!B:I,8,0),\"\"))","v":""},{"$f":"IF(IFERROR(VLOOKUP(N$5&A5,计划!B:J,9,0),\"\")=0,\"\",IFERROR(VLOOKUP(N$5&A5,计划!B:J,9,0),\"\"))","v":""},{"$f":"IF(IFERROR(VLOOKUP(N$5&A5,计划!B:K,10,0),\"\")=0,\"\",IFERROR(VLOOKUP(N$5&A5,计划!B:K,10,0),\"\"))","v":""},{"$f":"IF(VLOOKUP(N6,专业!C:F,4,0)=\"专业代码\",\"\",VLOOKUP(N6,专业!C:F,4,0))","v":""}]
["02",{"$f":"IFERROR(VLOOKUP(N$5&A6,计划!B:E,4,0),\"\")","v":""},{"$f":"IFERROR(VLOOKUP(N$5&A6,计划!B:F,5,0),\"\")","v":""},{"$f":"IFERROR(VLOOKUP(B6,课程代码!B:E,4,0),\"\")","v":""},{"$f":"IFERROR(VLOOKUP(N$5&A6,计划!B:G,6,0),\"\")","v":""},{"$f":"IFERROR(VLOOKUP(B6,IF({1,0},R:R,Q:Q),2,0),\"\")","v":""},"",{"$f":"IFERROR(IF(G6<>\"\",VLOOKUP(N$5&A6,计划!B:G,6,0),\"\"),\"\")&IFERROR(IF(I6<>\"\",VLOOKUP(N$5&A6,计划!B:G,6,0),\"\"),\"\")","v":""},"",{"$f":"IF(IFERROR(VLOOKUP(N$5&A6,计划!B:H,7,0),\"\")=0,\"\",IFERROR(VLOOKUP(N$5&A6,计划!B:H,7,0),\"\"))","v":""},{"$f":"IF(IFERROR(VLOOKUP(N$5&A6,计划!B:I,8,0),\"\")=0,\"\",IFERROR(VLOOKUP(N$5&A6,计划!B:I,8,0),\"\"))","v":""},{"$f":"IF(IFERROR(VLOOKUP(N$5&A6,计划!B:J,9,0),\"\")=0,\"\",IFERROR(VLOOKUP(N$5&A6,计划!B:J,9,0),\"\"))","v":""},{"$f":"IF(IFERROR(VLOOKUP(N$5&A6,计划!B:K,10,0),\"\")=0,\"\",IFERROR(VLOOKUP(N$5&A6,计划!B:K,10,0),\"\"))","v":""},"专业名称"]
["03",{"$f":"IFERROR(VLOOKUP(N$5&A7,计划!B:E,4,0),\"\")","v":""},{"$f":"IFERROR(VLOOKUP(N$5&A7,计划!B:F,5,0),\"\")","v":""},{"$f":"IFERROR(VLOOKUP(B7,课程代码!B:E,4,0),\"\")","v":""},{"$f":"IFERROR(VLOOKUP(N$5&A7,计划!B:G,6,0),\"\")","v":""},{"$f":"IFERROR(VLOOKUP(B7,IF({1,0},R:R,Q:Q),2,0),\"\")","v":""},"",{"$f":"IFERROR(IF(G7<>\"\",VLOOKUP(N$5&A7,计划!B:G,6,0),\"\"),\"\")&IFERROR(IF(I7<>\"\",VLOOKUP(N$5&A7,计划!B:G,6,0),\"\"),\"\")","v":""},"",{"$f":"IF(IFERROR(VLOOKUP(N$5&A7,计划!B:H,7,0),\"\")=0,\"\",IFERROR(VLOOKUP(N$5&A7,计划!B:H,7,0),\"\"))","v":""},{"$f":"IF(IFERROR(VLOOKUP(N$5&A7,计划!B:I,8,0),\"\")=0,\"\",IFERROR(VLOOKUP(N$5&A7,计划!B:I,8,0),\"\"))","v":""},{"$f":"IF(IFERROR(VLOOKUP(N$5&A7,计划!B:J,9,0),\"\")=0,\"\",IFERROR(VLOOKUP(N$5&A7,计划!B:J,9,0),\"\"))","v":""},{"$f":"IF(IFERROR(VLOOKUP(N$5&A7,计划!B:K,10,0),\"\")=0,\"\",IFERROR(VLOOKUP(N$5&A7,计划!B:K,10,0),\"\"))","v":""}]
["04",{"$f":"IFERROR(VLOOKUP(N$5&A8,计划!B:E,4,0),\"\")","v":""},{"$f":"IFERROR(VLOOKUP(N$5&A8,计划!B:F,5,0),\"\")","v":""},{"$f":"IFERROR(VLOOKUP(B8,课程代码!B:E,4,0),\"\")","v":""},{"$f":"IFERROR(VLOOKUP(N$5&A8,计划!B:G,6,0),\"\")","v":""},{"$f":"IFERROR(VLOOKUP(B8,IF({1,0},R:R,Q:Q),2,0),\"\")","v":""},"",{"$f":"IFERROR(IF(G8<>\"\",VLOOKUP(N$5&A8,计划!B:G,6,0),\"\"),\"\")&IFERROR(IF(I8<>\"\",VLOOKUP(N$5&A8,计划!B:G,6,0),\"\"),\"\")","v":""},"",{"$f":"IF(IFERROR(VLOOKUP(N$5&A8,计划!B:H,7,0),\"\")=0,\"\",IFERROR(VLOOKUP(N$5&A8,计划!B:H,7,0),\"\"))","v":""},{"$f":"IF(IFERROR(VLOOKUP(N$5&A8,计划!B:I,8,0),\"\")=0,\"\",IFERROR(VLOOKUP(N$5&A8,计划!B:I,8,0),\"\"))","v":""},{"$f":"IF(IFERROR(VLOOKUP(N$5&A8,计划!B:J,9,0),\"\")=0,\"\",IFERROR(VLOOKUP(N$5&A8,计划!B:J,9,0),\"\"))","v":""},{"$f":"IF(IFERROR(VLOOKUP(N$5&A8,计划!B:K,10,0),\"\")=0,\"\",IFERROR(VLOOKUP(N$5&A8,计划!B:K,10,0),\"\"))","v":""},"             查询说明\n\n1.在自考管理系统里查询成绩，点击打印，在下载的word中全选，复制。\n\n在本表的右边O1单元格处理（红框）\n\n粘贴(选择匹配目标格式，WPS选择无格式粘贴）。\n\n2.在上方专业名称处点击一下，出现下拉箭头，选择学生专业。\n\n3.左边的表格自动会显示学生专业计划成绩合格情况！\n\n"]
["05",{"$f":"IFERROR(VLOOKUP(N$5&A9,计划!B:E,4,0),\"\")","v":""},{"$f":"IFERROR(VLOOKUP(N$5&A9,计划!B:F,5,0),\"\")","v":""},{"$f":"IFERROR(VLOOKUP(B9,课程代码!B:E,4,0),\"\")","v":""},{"$f":"IFERROR(VLOOKUP(N$5&A9,计划!B:G,6,0),\"\")","v":""},{"$f":"IFERROR(VLOOKUP(B9,IF({1,0},R:R,Q:Q),2,0),\"\")","v":""},"",{"$f":"IFERROR(IF(G9<>\"\",VLOOKUP(N$5&A9,计划!B:G,6,0),\"\"),\"\")&IFERROR(IF(I9<>\"\",VLOOKUP(N$5&A9,计划!B:G,6,0),\"\"),\"\")","v":""},"",{"$f":"IF(IFERROR(VLOOKUP(N$5&A9,计划!B:H,7,0),\"\")=0,\"\",IFERROR(VLOOKUP(N$5&A9,计划!B:H,7,0),\"\"))","v":""},{"$f":"IF(IFERROR(VLOOKUP(N$5&A9,计划!B:I,8,0),\"\")=0,\"\",IFERROR(VLOOKUP(N$5&A9,计划!B:I,8,0),\"\"))","v":""},{"$f":"IF(IFERROR(VLOOKUP(N$5&A9,计划!B:J,9,0),\"\")=0,\"\",IFERROR(VLOOKUP(N$5&A9,计划!B:J,9,0),\"\"))","v":""},{"$f":"IF(IFERROR(VLOOKUP(N$5&A9,计划!B:K,10,0),\"\")=0,\"\",IFERROR(VLOOKUP(N$5&A9,计划!B:K,10,0),\"\"))","v":""}]
["06",{"$f":"IFERROR(VLOOKUP(N$5&A10,计划!B:E,4,0),\"\")","v":""},{"$f":"IFERROR(VLOOKUP(N$5&A10,计划!B:F,5,0),\"\")","v":""},{"$f":"IFERROR(VLOOKUP(B10,课程代码!B:E,4,0),\"\")","v":""},{"$f":"IFERROR(VLOOKUP(N$5&A10,计划!B:G,6,0),\"\")","v":""},{"$f":"IFERROR(VLOOKUP(B10,IF({1,0},R:R,Q:Q),2,0),\"\")","v":""},"",{"$f":"IFERROR(IF(G10<>\"\",VLOOKUP(N$5&A10,计划!B:G,6,0),\"\"),\"\")&IFERROR(IF(I10<>\"\",VLOOKUP(N$5&A10,计划!B:G,6,0),\"\"),\"\")","v":""},"",{"$f":"IF(IFERROR(VLOOKUP(N$5&A10,计划!B:H,7,0),\"\")=0,\"\",IFERROR(VLOOKUP(N$5&A10,计划!B:H,7,0),\"\"))","v":""},{"$f":"IF(IFERROR(VLOOKUP(N$5&A10,计划!B:I,8,0),\"\")=0,\"\",IFERROR(VLOOKUP(N$5&A10,计划!B:I,8,0),\"\"))","v":""},{"$f":"IF(IFERROR(VLOOKUP(N$5&A10,计划!B:J,9,0),\"\")=0,\"\",IFERROR(VLOOKUP(N$5&A10,计划!B:J,9,0),\"\"))","v":""},{"$f":"IF(IFERROR(VLOOKUP(N$5&A10,计划!B:K,10,0),\"\")=0,\"\",IFERROR(VLOOKUP(N$5&A10,计划!B:K,10,0),\"\"))","v":""}]
["07",{"$f":"IFERROR(VLOOKUP(N$5&A11,计划!B:E,4,0),\"\")","v":""},{"$f":"IFERROR(VLOOKUP(N$5&A11,计划!B:F,5,0),\"\")","v":""},{"$f":"IFERROR(VLOOKUP(B11,课程代码!B:E,4,0),\"\")","v":""},{"$f":"IFERROR(VLOOKUP(N$5&A11,计划!B:G,6,0),\"\")","v":""},{"$f":"IFERROR(VLOOKUP(B11,IF({1,0},R:R,Q:Q),2,0),\"\")","v":""},"",{"$f":"IFERROR(IF(G11<>\"\",VLOOKUP(N$5&A11,计划!B:G,6,0),\"\"),\"\")&IFERROR(IF(I11<>\"\",VLOOKUP(N$5&A11,计划!B:G,6,0),\"\"),\"\")","v":""},"",{"$f":"IF(IFERROR(VLOOKUP(N$5&A11,计划!B:H,7,0),\"\")=0,\"\",IFERROR(VLOOKUP(N$5&A11,计划!B:H,7,0),\"\"))","v":""},{"$f":"IF(IFERROR(VLOOKUP(N$5&A11,计划!B:I,8,0),\"\")=0,\"\",IFERROR(VLOOKUP(N$5&A11,计划!B:I,8,0),\"\"))","v":""},{"$f":"IF(IFERROR(VLOOKUP(N$5&A11,计划!B:J,9,0),\"\")=0,\"\",IFERROR(VLOOKUP(N$5&A11,计划!B:J,9,0),\"\"))","v":""},{"$f":"IF(IFERROR(VLOOKUP(N$5&A11,计划!B:K,10,0),\"\")=0,\"\",IFERROR(VLOOKUP(N$5&A11,计划!B:K,10,0),\"\"))","v":""}]
["08",{"$f":"IFERROR(VLOOKUP(N$5&A12,计划!B:E,4,0),\"\")","v":""},{"$f":"IFERROR(VLOOKUP(N$5&A12,计划!B:F,5,0),\"\")","v":""},{"$f":"IFERROR(VLOOKUP(B12,课程代码!B:E,4,0),\"\")","v":""},{"$f":"IFERROR(VLOOKUP(N$5&A12,计划!B:G,6,0),\"\")","v":""},{"$f":"IFERROR(VLOOKUP(B12,IF({1,0},R:R,Q:Q),2,0),\"\")","v":""},"",{"$f":"IFERROR(IF(G12<>\"\",VLOOKUP(N$5&A12,计划!B:G,6,0),\"\"),\"\")&IFERROR(IF(I12<>\"\",VLOOKUP(N$5&A12,计划!B:G,6,0),\"\"),\"\")","v":""},"",{"$f":"IF(IFERROR(VLOOKUP(N$5&A12,计划!B:H,7,0),\"\")=0,\"\",IFERROR(VLOOKUP(N$5&A12,计划!B:H,7,0),\"\"))","v":""},{"$f":"IF(IFERROR(VLOOKUP(N$5&A12,计划!B:I,8,0),\"\")=0,\"\",IFERROR(VLOOKUP(N$5&A12,计划!B:I,8,0),\"\"))","v":""},{"$f":"IF(IFERROR(VLOOKUP(N$5&A12,计划!B:J,9,0),\"\")=0,\"\",IFERROR(VLOOKUP(N$5&A12,计划!B:J,9,0),\"\"))","v":""},{"$f":"IF(IFERROR(VLOOKUP(N$5&A12,计划!B:K,10,0),\"\")=0,\"\",IFERROR(VLOOKUP(N$5&A12,计划!B:K,10,0),\"\"))","v":""}]
["09",{"$f":"IFERROR(VLOOKUP(N$5&A13,计划!B:E,4,0),\"\")","v":""},{"$f":"IFERROR(VLOOKUP(N$5&A13,计划!B:F,5,0),\"\")","v":""},{"$f":"IFERROR(VLOOKUP(B13,课程代码!B:E,4,0),\"\")","v":""},{"$f":"IFERROR(VLOOKUP(N$5&A13,计划!B:G,6,0),\"\")","v":""},{"$f":"IFERROR(VLOOKUP(B13,IF({1,0},R:R,Q:Q),2,0),\"\")","v":""},"",{"$f":"IFERROR(IF(G13<>\"\",VLOOKUP(N$5&A13,计划!B:G,6,0),\"\"),\"\")&IFERROR(IF(I13<>\"\",VLOOKUP(N$5&A13,计划!B:G,6,0),\"\"),\"\")","v":""},"",{"$f":"IF(IFERROR(VLOOKUP(N$5&A13,计划!B:H,7,0),\"\")=0,\"\",IFERROR(VLOOKUP(N$5&A13,计划!B:H,7,0),\"\"))","v":""},{"$f":"IF(IFERROR(VLOOKUP(N$5&A13,计划!B:I,8,0),\"\")=0,\"\",IFERROR(VLOOKUP(N$5&A13,计划!B:I,8,0),\"\"))","v":""},{"$f":"IF(IFERROR(VLOOKUP(N$5&A13,计划!B:J,9,0),\"\")=0,\"\",IFERROR(VLOOKUP(N$5&A13,计划!B:J,9,0),\"\"))","v":""},{"$f":"IF(IFERROR(VLOOKUP(N$5&A13,计划!B:K,10,0),\"\")=0,\"\",IFERROR(VLOOKUP(N$5&A13,计划!B:K,10,0),\"\"))","v":""}]
["10",{"$f":"IFERROR(VLOOKUP(N$5&A14,计划!B:E,4,0),\"\")","v":""},{"$f":"IFERROR(VLOOKUP(N$5&A14,计划!B:F,5,0),\"\")","v":""},{"$f":"IFERROR(VLOOKUP(B14,课程代码!B:E,4,0),\"\")","v":""},{"$f":"IFERROR(VLOOKUP(N$5&A14,计划!B:G,6,0),\"\")","v":""},{"$f":"IFERROR(VLOOKUP(B14,IF({1,0},R:R,Q:Q),2,0),\"\")","v":""},"",{"$f":"IFERROR(IF(G14<>\"\",VLOOKUP(N$5&A14,计划!B:G,6,0),\"\"),\"\")&IFERROR(IF(I14<>\"\",VLOOKUP(N$5&A14,计划!B:G,6,0),\"\"),\"\")","v":""},"",{"$f":"IF(IFERROR(VLOOKUP(N$5&A14,计划!B:H,7,0),\"\")=0,\"\",IFERROR(VLOOKUP(N$5&A14,计划!B:H,7,0),\"\"))","v":""},{"$f":"IF(IFERROR(VLOOKUP(N$5&A14,计划!B:I,8,0),\"\")=0,\"\",IFERROR(VLOOKUP(N$5&A14,计划!B:I,8,0),\"\"))","v":""},{"$f":"IF(IFERROR(VLOOKUP(N$5&A14,计划!B:J,9,0),\"\")=0,\"\",IFERROR(VLOOKUP(N$5&A14,计划!B:J,9,0),\"\"))","v":""},{"$f":"IF(IFERROR(VLOOKUP(N$5&A14,计划!B:K,10,0),\"\")=0,\"\",IFERROR(VLOOKUP(N$5&A14,计划!B:K,10,0),\"\"))","v":""}]
["11",{"$f":"IFERROR(VLOOKUP(N$5&A15,计划!B:E,4,0),\"\")","v":""},{"$f":"IFERROR(VLOOKUP(N$5&A15,计划!B:F,5,0),\"\")","v":""},{"$f":"IFERROR(VLOOKUP(B15,课程代码!B:E,4,0),\"\")","v":""},{"$f":"IFERROR(VLOOKUP(N$5&A15,计划!B:G,6,0),\"\")","v":""},{"$f":"IFERROR(VLOOKUP(B15,IF({1,0},R:R,Q:Q),2,0),\"\")","v":""},"",{"$f":"IFERROR(IF(G15<>\"\",VLOOKUP(N$5&A15,计划!B:G,6,0),\"\"),\"\")&IFERROR(IF(I15<>\"\",VLOOKUP(N$5&A15,计划!B:G,6,0),\"\"),\"\")","v":""},"",{"$f":"IF(IFERROR(VLOOKUP(N$5&A15,计划!B:H,7,0),\"\")=0,\"\",IFERROR(VLOOKUP(N$5&A15,计划!B:H,7,0),\"\"))","v":""},{"$f":"IF(IFERROR(VLOOKUP(N$5&A15,计划!B:I,8,0),\"\")=0,\"\",IFERROR(VLOOKUP(N$5&A15,计划!B:I,8,0),\"\"))","v":""},{"$f":"IF(IFERROR(VLOOKUP(N$5&A15,计划!B:J,9,0),\"\")=0,\"\",IFERROR(VLOOKUP(N$5&A15,计划!B:J,9,0),\"\"))","v":""},{"$f":"IF(IFERROR(VLOOKUP(N$5&A15,计划!B:K,10,0),\"\")=0,\"\",IFERROR(VLOOKUP(N$5&A15,计划!B:K,10,0),\"\"))","v":""}]
["12",{"$f":"IFERROR(VLOOKUP(N$5&A16,计划!B:E,4,0),\"\")","v":""},{"$f":"IFERROR(VLOOKUP(N$5&A16,计划!B:F,5,0),\"\")","v":""},{"$f":"IFERROR(VLOOKUP(B16,课程代码!B:E,4,0),\"\")","v":""},{"$f":"IFERROR(VLOOKUP(N$5&A16,计划!B:G,6,0),\"\")","v":""},{"$f":"IFERROR(VLOOKUP(B16,IF({1,0},R:R,Q:Q),2,0),\"\")","v":""},"",{"$f":"IFERROR(IF(G16<>\"\",VLOOKUP(N$5&A16,计划!B:G,6,0),\"\"),\"\")&IFERROR(IF(I16<>\"\",VLOOKUP(N$5&A16,计划!B:G,6,0),\"\"),\"\")","v":""},"",{"$f":"IF(IFERROR(VLOOKUP(N$5&A16,计划!B:H,7,0),\"\")=0,\"\",IFERROR(VLOOKUP(N$5&A16,计划!B:H,7,0),\"\"))","v":""},{"$f":"IF(IFERROR(VLOOKUP(N$5&A16,计划!B:I,8,0),\"\")=0,\"\",IFERROR(VLOOKUP(N$5&A16,计划!B:I,8,0),\"\"))","v":""},{"$f":"IF(IFERROR(VLOOKUP(N$5&A16,计划!B:J,9,0),\"\")=0,\"\",IFERROR(VLOOKUP(N$5&A16,计划!B:J,9,0),\"\"))","v":""},{"$f":"IF(IFERROR(VLOOKUP(N$5&A16,计划!B:K,10,0),\"\")=0,\"\",IFERROR(VLOOKUP(N$5&A16,计划!B:K,10,0),\"\"))","v":""}]
["13",{"$f":"IFERROR(VLOOKUP(N$5&A17,计划!B:E,4,0),\"\")","v":""},{"$f":"IFERROR(VLOOKUP(N$5&A17,计划!B:F,5,0),\"\")","v":""},{"$f":"IFERROR(VLOOKUP(B17,课程代码!B:E,4,0),\"\")","v":""},{"$f":"IFERROR(VLOOKUP(N$5&A17,计划!B:G,6,0),\"\")","v":""},{"$f":"IFERROR(VLOOKUP(B17,IF({1,0},R:R,Q:Q),2,0),\"\")","v":""},"",{"$f":"IFERROR(IF(G17<>\"\",VLOOKUP(N$5&A17,计划!B:G,6,0),\"\"),\"\")&IFERROR(IF(I17<>\"\",VLOOKUP(N$5&A17,计划!B:G,6,0),\"\"),\"\")","v":""},"",{"$f":"IF(IFERROR(VLOOKUP(N$5&A17,计划!B:H,7,0),\"\")=0,\"\",IFERROR(VLOOKUP(N$5&A17,计划!B:H,7,0),\"\"))","v":""},{"$f":"IF(IFERROR(VLOOKUP(N$5&A17,计划!B:I,8,0),\"\")=0,\"\",IFERROR(VLOOKUP(N$5&A17,计划!B:I,8,0),\"\"))","v":""},{"$f":"IF(IFERROR(VLOOKUP(N$5&A17,计划!B:J,9,0),\"\")=0,\"\",IFERROR(VLOOKUP(N$5&A17,计划!B:J,9,0),\"\"))","v":""},{"$f":"IF(IFERROR(VLOOKUP(N$5&A17,计划!B:K,10,0),\"\")=0,\"\",IFERROR(VLOOKUP(N$5&A17,计划!B:K,10,0),\"\"))","v":""}]
["14",{"$f":"IFERROR(VLOOKUP(N$5&A18,计划!B:E,4,0),\"\")","v":""},{"$f":"IFERROR(VLOOKUP(N$5&A18,计划!B:F,5,0),\"\")","v":""},{"$f":"IFERROR(VLOOKUP(B18,课程代码!B:E,4,0),\"\")","v":""},{"$f":"IFERROR(VLOOKUP(N$5&A18,计划!B:G,6,0),\"\")","v":""},{"$f":"IFERROR(VLOOKUP(B18,IF({1,0},R:R,Q:Q),2,0),\"\")","v":""},"",{"$f":"IFERROR(IF(G18<>\"\",VLOOKUP(N$5&A18,计划!B:G,6,0),\"\"),\"\")&IFERROR(IF(I18<>\"\",VLOOKUP(N$5&A18,计划!B:G,6,0),\"\"),\"\")","v":""},"",{"$f":"IF(IFERROR(VLOOKUP(N$5&A18,计划!B:H,7,0),\"\")=0,\"\",IFERROR(VLOOKUP(N$5&A18,计划!B:H,7,0),\"\"))","v":""},{"$f":"IF(IFERROR(VLOOKUP(N$5&A18,计划!B:I,8,0),\"\")=0,\"\",IFERROR(VLOOKUP(N$5&A18,计划!B:I,8,0),\"\"))","v":""},{"$f":"IF(IFERROR(VLOOKUP(N$5&A18,计划!B:J,9,0),\"\")=0,\"\",IFERROR(VLOOKUP(N$5&A18,计划!B:J,9,0),\"\"))","v":""},{"$f":"IF(IFERROR(VLOOKUP(N$5&A18,计划!B:K,10,0),\"\")=0,\"\",IFERROR(VLOOKUP(N$5&A18,计划!B:K,10,0),\"\"))","v":""}]
["15",{"$f":"IFERROR(VLOOKUP(N$5&A19,计划!B:E,4,0),\"\")","v":""},{"$f":"IFERROR(VLOOKUP(N$5&A19,计划!B:F,5,0),\"\")","v":""},{"$f":"IFERROR(VLOOKUP(B19,课程代码!B:E,4,0),\"\")","v":""},{"$f":"IFERROR(VLOOKUP(N$5&A19,计划!B:G,6,0),\"\")","v":""},{"$f":"IFERROR(VLOOKUP(B19,IF({1,0},R:R,Q:Q),2,0),\"\")","v":""},"",{"$f":"IFERROR(IF(G19<>\"\",VLOOKUP(N$5&A19,计划!B:G,6,0),\"\"),\"\")&IFERROR(IF(I19<>\"\",VLOOKUP(N$5&A19,计划!B:G,6,0),\"\"),\"\")","v":""},"",{"$f":"IF(IFERROR(VLOOKUP(N$5&A19,计划!B:H,7,0),\"\")=0,\"\",IFERROR(VLOOKUP(N$5&A19,计划!B:H,7,0),\"\"))","v":""},{"$f":"IF(IFERROR(VLOOKUP(N$5&A19,计划!B:I,8,0),\"\")=0,\"\",IFERROR(VLOOKUP(N$5&A19,计划!B:I,8,0),\"\"))","v":""},{"$f":"IF(IFERROR(VLOOKUP(N$5&A19,计划!B:J,9,0),\"\")=0,\"\",IFERROR(VLOOKUP(N$5&A19,计划!B:J,9,0),\"\"))","v":""},{"$f":"IF(IFERROR(VLOOKUP(N$5&A19,计划!B:K,10,0),\"\")=0,\"\",IFERROR(VLOOKUP(N$5&A19,计划!B:K,10,0),\"\"))","v":""}]
["16",{"$f":"IFERROR(VLOOKUP(N$5&A20,计划!B:E,4,0),\"\")","v":""},{"$f":"IFERROR(VLOOKUP(N$5&A20,计划!B:F,5,0),\"\")","v":""},{"$f":"IFERROR(VLOOKUP(B20,课程代码!B:E,4,0),\"\")","v":""},{"$f":"IFERROR(VLOOKUP(N$5&A20,计划!B:G,6,0),\"\")","v":""},{"$f":"IFERROR(VLOOKUP(B20,IF({1,0},R:R,Q:Q),2,0),\"\")","v":""},"",{"$f":"IFERROR(IF(G20<>\"\",VLOOKUP(N$5&A20,计划!B:G,6,0),\"\"),\"\")&IFERROR(IF(I20<>\"\",VLOOKUP(N$5&A20,计划!B:G,6,0),\"\"),\"\")","v":""},"",{"$f":"IF(IFERROR(VLOOKUP(N$5&A20,计划!B:H,7,0),\"\")=0,\"\",IFERROR(VLOOKUP(N$5&A20,计划!B:H,7,0),\"\"))","v":""},{"$f":"IF(IFERROR(VLOOKUP(N$5&A20,计划!B:I,8,0),\"\")=0,\"\",IFERROR(VLOOKUP(N$5&A20,计划!B:I,8,0),\"\"))","v":""},{"$f":"IF(IFERROR(VLOOKUP(N$5&A20,计划!B:J,9,0),\"\")=0,\"\",IFERROR(VLOOKUP(N$5&A20,计划!B:J,9,0),\"\"))","v":""},{"$f":"IF(IFERROR(VLOOKUP(N$5&A20,计划!B:K,10,0),\"\")=0,\"\",IFERROR(VLOOKUP(N$5&A20,计划!B:K,10,0),\"\"))","v":""}]
{"$rows_left_out":24}
{"sheet":"新旧计划","index":1,"n_rows":60,"n_cols":8,"rows_kept":60,"cut":false,"hidden":false,"merged":[]}
["序号","课程代码","课程名称","旧课程代码","旧课程名称","学分","升降","课程调整及学分变动情况"]
[1,2160,"流体力学","03347","流体力学",null,null,"替换原03347"]
[2,4624,"工程经济学","02194","工程经济",null,null,"替换原02194"]
[3,8119,"管理会计","00157","管理会计(一)",5,"↓5","替换原00157，学分降为5"]
[4,10993,"工程数学（线性代数、概率论与数理统计）","06268","工程数学",6,"↓6","替换原06268，学分降为6"]
[5,13000,"英语(专升本)","00015","英语(二)",7,"↓7","替换原00015，学分降为7"]
[6,13005,"软件工程","02333","软件工程",null,null,"替换原02333"]
[7,13013,"高级语言程序设计","00342","高级语言程序设计(一)",4,"↑4","替换原00342，学分升为4"]
[8,13124,"英语(专)","00012","英语(一)",null,null,"替换原00012"]
[9,13125,"高等数学(经管类)","00020","高等数学(一)",null,null,"替换原00020"]
[10,13129,"英汉互译","00087","英语翻译",null,null,"替换原00087"]
[11,13130,"国际贸易实务","00090","国际贸易实务(一)",3,"↓3","替换原00090，学分降为3"]
[12,13135,"西方经济学（中级）","00139","西方经济学",null,null,"替换原00139"]
[13,13136,"人力资源管理(初级)","00147","人力资源管理(一)",null,null,"替换原00147"]
[14,13137,"质量管理","00153","质量管理(一)",null,null,"替换原00153"]
[15,13138,"财务会计（初级）","00155","中级财务会计",6,"↓6","替换原00155，学分降为6"]
[16,13139,"成本会计","00156","成本会计",3,"↓3","替换原00156，学分降为3"]
[17,13140,"财务会计（中级）","00159","高级财务会计",null,null,"替换原00159"]
[18,13141,"财务报表分析","00161","财务报表分析(一)",null,null,"替换原00161"]
[19,13142,"广告学","00181","广告学(一)",null,null,"替换原00181"]
{"$rows_left_out":41}
{"sheet":"专业","index":2,"n_rows":148,"n_cols":7,"rows_kept":148,"cut":false,"hidden":false,"merged":[]}
["序号","专业代码","专业名称","学分","备注","专业代码","层次"]
[1,"030503","030503思想政治教育(本科)",70,"不少于4门，不低于20学分","030503","本科"]
[2,"080905","080905物联网工程(本科)",72,"不少于4门，不低于18学分","080905","本科"]
[3,"083102K","083102K消防工程(本科)",71,"不少于4门，不低于26学分","083102K","本科"]
[4,"B020106","B020106金融(本科)",70,"不少于4门，不低于25学分","B020106","本科"]
[5,"B020108","B020108保险(本科)",null,null,"B020108","本科"]
[6,"B020110","B020110国际贸易(本科)",70,"不少于4门，不低于21学分","B020110","本科"]
[7,"B020115","B020115经济学(本科)",null,null,"B020115","本科"]
[8,"B020180","B020180会展管理(本科)",null,null,"B020180","本科"]
[9,"B020202","B020202工商企业管理(本科)",72,"不少于4门，不低于30学分","B020202","本科"]
[10,"B020204","B020204会计(本科)",70,"不少于3门，不低于19学分","B020204","本科"]
[11,"B020208","B020208市场营销(独立本科)",70,"不少于4门，不低于27学分","B020208","本科"]
[12,"B020210","B020210旅游管理(本科)",null,null,"B020210","本科"]
[13,"B020213","B020213企业财务管理(本科)",72,"不少于3门，不低于24学分","B020213","本科"]
[14,"B020216","B020216电子商务(移动方向)(本科)",70,"不少于5门，不低于34学分","B020216","本科"]
[15,"B020217","B020217土地资源管理(本科)",null,null,"B020217","本科"]
[16,"B020218","B020218人力资源管理(本科)",74,"不少于3门，不低于22学分","B020218","本科"]
[17,"B020224","B020224房地产经营与管理(本科)",null,null,"B020224","本科"]
[18,"B020225","B020225知识产权管理(本科)",null,null,"B020225","本科"]
[19,"B020229","B020229物流管理(本科)",null,null,"B020229","本科"]
{"$rows_left_out":129}
{"sheet":"计划","index":3,"n_rows":3533,"n_cols":16,"rows_kept":3533,"cut":false,"hidden":false,"merged":[]}
["序号","专课序号","专业代码","专业名称","课程代码","课程名称","学分","备注","置换1","置换2","置换3"]
[1,"03050301","030503","思想政治教育(本科)","13000","英语(专升本)","7/14","00015",null,"00015",null,null,null,13000,"英语(专升本)",7]
[2,"03050302","030503","思想政治教育(本科)","14008","马克思主义哲学概论",6,"  "]
[3,"03050303","030503","思想政治教育(本科)","15040","习近平新时代中国特色社会主义思想概论","3"]
[4,"03050304","030503","思想政治教育(本科)","14009","马克思主义政治经济学概论",6,"  "]
[5,"03050305","030503","思想政治教育(本科)","13933","科学社会主义概论",6,"  "]
[6,"03050306","030503","思想政治教育(本科)","07082","马克思主义原著选读",4,"  "]
[7,"03050307","030503","思想政治教育(本科)","14007","马克思主义发展史",5,"  "]
[8,"03050308","030503","思想政治教育(本科)","14279","思想政治教育学",4,"  "]
[9,"03050309","030503","思想政治教育(本科)","14280","思想政治教育学(实践)",2]
[10,"03050310","030503","思想政治教育(本科)","07080","中国共产党史",6,"  "]
[11,"03050311","030503","思想政治教育(本科)","14690","中国共产党思想政治教育史",4,"  "]
[12,"03050312","030503","思想政治教育(本科)"," ","以下选考课程"," "," "]
[13,"03050313","030503","思想政治教育(本科)","00315","当代中国政治制度",6,"选考课程必要条件"]
[14,"03050314","030503","思想政治教育(本科)","06408","当代世界经济与政治",6,"不少于4门"]
[15,"03050315","030503","思想政治教育(本科)","14278","思想政治教育心理学",4,"不得低于20学分"]
[16,"03050316","030503","思想政治教育(本科)","14184","社会思潮与青年教育",4,"毕业总学分70"]
[17,"03050317","030503","思想政治教育(本科)","14068","企业思想政治工作",3,"  "]
[18,"03050318","030503","思想政治教育(本科)","14069","企业思想政治工作(实践)",1]
[19,"03050319","030503","思想政治教育(本科)","14506","学生事务管理",3]
{"$rows_left_out":3514}
{"sheet":"课程代码","index":4,"n_rows":2926,"n_cols":7,"rows_kept":2926,"cut":false,"hidden":false,"merged":[]}
["序号","课程代码","课程名称","课程代码","类别"]
[1,"00001","马克思主义哲学原理","00001","国考",null,1]
[2,"00002","邓小平理论概论","00002","国考",null,1]
[3,"00003","法律基础与思想道德修养","00003","国考",null,1]
[4,"00004","毛泽东思想概论","00004","国考",null,1]
[5,"00005","马克思主义政治经济学原理","00005","国考",null,1]
[6,"00009","政治经济学(财经类)","00009","国考",null,1]
[7,"00010","大学语文","00010","国考",null,1]
[8,"00012","英语(一)","00012","国考",null,1]
[9,"00015","英语(二)","00015","国考",null,1]
[10,"00018","计算机应用基础","00018","国考",null,1]
[11,"00019","计算机应用基础(实践)","00019",null,"实践",1]
[12,"00020","高等数学(一)","00020","国考",null,1]
[13,"00021","高等数学(二)","00021","国考",null,1]
[14,"00022","高等数学(工专)","00022","国考",null,1]
[15,"00023","高等数学(工本)","00023","国考",null,1]
[16,"00024","普通逻辑","00024","国考",null,1]
[17,"00031","心理学","00031","国考",null,1]
[18,"00034","社会学概论","00034","国考",null,1]
[19,"00037","美学","00037","国考",null,1]
{"$rows_left_out":2907}
{"sheet":"强实践","index":5,"n_rows":90,"n_cols":5,"rows_kept":90,"cut":false,"hidden":false,"merged":[]}
["序号","课程代码","课程名称","类型 1","类型 2"]
["1","00679","服装工艺","强实践课"]
["2","00697","工业设计表现技法","强实践课"]
["3","00716","印刷工艺","强实践课"]
["4","02411","道路施工与管理","强实践课"]
["5","02854","林业推广技能","强实践课"]
["6","03539","汽车美容与装饰","强实践课"]
["7","04216","森林规划与设计","强实践课"]
["8","04444","汽车鉴定与评估","强实践课"]
["9","05389","人机界面设计","强实践课"]
["10","06916","综合技能考试","强实践课"]
["11","07299","交通运输管理信息系统","强实践课"]
["12","07539","时装画","强实践课"]
["13","08252","网络新闻理论与实务","强实践课"]
["14","08777","畜牧兽医综合技能生产","强实践课"]
["15","09042","Web 程序设计","强实践课"]
["16","10083","水利水电工程施工组织与管理","强实践课"]
["17","10088","社会工作综合能力","强实践课"]
["18","10824","动物养殖与防病综合实习","强实践课"]
["19","10842","园林花卉综合实习","强实践课"]
{"$rows_left_out":70}